Reaction Details
TargetMu-type opioid receptor
LigandBDBM50210550
Substrate/Competitorn/a
Meas. Tech.ChEMBL_444088 (CHEMBL893251)
IC50 380±n/a nM
Citation Peng, XKnapp, BIBidlack, JMNeumeyer, JL In-vitro investigation of oxazol and urea analogues of morphinan at opioid receptors. Bioorg Med Chem15:4106-12 (2007) 
 
Mu-type opioid receptor
Name:Mu-type opioid receptor
Type:G Protein-Coupled Receptor (GPCR)
Mol. Mass.:44789.51
Organism:Homo sapiens (Human)
Description:P35372
Residue:400
BDBM50210550
NameBDBM50210550
Synonyms:CHEMBL242968 N-cyclopropylmethylmorphinan-3-amino-urea
TypeSmall organic molecule
Emp. Form.C21H29N3O
Mol. Mass.339.4745
SMILESNC(=O)Nc1ccc2C[C@@H]3[C@@H]4CCCC[C@]4(CCN3CC3CC3)c2c1