Reaction Details
TargetKappa-type opioid receptor
LigandBDBM50210555
Substrate/Competitorn/a
Meas. Tech.ChEMBL_444084 (CHEMBL893247)
EC50 87±n/a nM
Citation Peng, XKnapp, BIBidlack, JMNeumeyer, JL In-vitro investigation of oxazol and urea analogues of morphinan at opioid receptors. Bioorg Med Chem15:4106-12 (2007) 
 
Kappa-type opioid receptor
Name:Kappa-type opioid receptor
Type:G Protein-Coupled Receptor (GPCR)
Mol. Mass.:42648.76
Organism:Homo sapiens (Human)
Description:P41145
Residue:380
BDBM50210555
NameBDBM50210555
Synonyms:CHEMBL394573 N-cyclobutylmethylmorphinan-3-amino-urea
TypeSmall organic molecule
Emp. Form.C22H31N3O
Mol. Mass.353.501
SMILESNC(=O)Nc1ccc2C[C@@H]3[C@@H]4CCCC[C@]4(CCN3CC3CCC3)c2c1