Reaction Details
TargetMu-type opioid receptor
LigandBDBM50210554
Substrate/Competitorn/a
Meas. Tech.ChEMBL_444079 (CHEMBL893242)
Ki 40±n/a nM
Citation Peng, XKnapp, BIBidlack, JMNeumeyer, JL In-vitro investigation of oxazol and urea analogues of morphinan at opioid receptors. Bioorg Med Chem15:4106-12 (2007) 
 
Mu-type opioid receptor
Name:Mu-type opioid receptor
Type:G Protein-Coupled Receptor (GPCR)
Mol. Mass.:44789.51
Organism:Homo sapiens (Human)
Description:P35372
Residue:400
BDBM50210554
NameBDBM50210554
Synonyms:2'-amino oxazole[5,4-b]-N-cyclobutylmethylmorphinan | CHEMBL242757
TypeSmall organic molecule
Emp. Form.C22H29N3O
Mol. Mass.351.4852
SMILESNc1nc2cc3C[C@@H]4[C@@H]5CCCC[C@]5(CCN4CC4CCC4)c3cc2o1