Reaction Details
TargetMu-type opioid receptor
LigandBDBM50210549
Substrate/Competitorn/a
Meas. Tech.ChEMBL_444079 (CHEMBL893242)
Ki 12±n/a nM
Citation Peng, XKnapp, BIBidlack, JMNeumeyer, JL In-vitro investigation of oxazol and urea analogues of morphinan at opioid receptors. Bioorg Med Chem15:4106-12 (2007) 
 
Mu-type opioid receptor
Name:Mu-type opioid receptor
Type:G Protein-Coupled Receptor (GPCR)
Mol. Mass.:44789.51
Organism:Homo sapiens (Human)
Description:P35372
Residue:400
BDBM50210549
NameBDBM50210549
Synonyms:3-methylurea-N-cyclobutylmethylmorphinan MCL-446
TypeSmall organic molecule
Emp. Form.C22H31N3O
Mol. Mass.353.501
SMILESCNC(=O)Nc1ccc2C[C@@H]3[C@@H]4CCCC[C@]4(CCN3CC3CC3)c2c1