Reaction Details
TargetMu-type opioid receptor
LigandBDBM50210557
Substrate/Competitorn/a
Meas. Tech.ChEMBL_444079 (CHEMBL893242)
Ki 1.5±n/a nM
Citation Peng, XKnapp, BIBidlack, JMNeumeyer, JL In-vitro investigation of oxazol and urea analogues of morphinan at opioid receptors. Bioorg Med Chem15:4106-12 (2007) 
 
Mu-type opioid receptor
Name:Mu-type opioid receptor
Type:G Protein-Coupled Receptor (GPCR)
Mol. Mass.:44789.51
Organism:Homo sapiens (Human)
Description:P35372
Residue:400
BDBM50210557
NameBDBM50210557
Synonyms:CHEMBL242756 | MCL-147
TypeSmall organic molecule
Emp. Form.C21H27N3S
Mol. Mass.353.524
SMILESNc1nc2cc3c(C[C@@H]4[C@@H]5CCCC[C@]35CCN4CC3CC3)cc2s1