Reaction Details
TargetDipeptidyl peptidase 9
LigandBDBM50210647
Substrate/Competitorn/a
Meas. Tech.ChEMBL_444120 (CHEMBL893279)
IC50>100000±n/a nM
Citation Kim, DKowalchick, JEEdmondson, SDMastracchio, AXu, JEiermann, GJLeiting, BWu, JKPryor, KDPatel, RAHe, HLyons, KAThornberry, NAWeber, AE Triazolopiperazine-amides as dipeptidyl peptidase IV inhibitors: close analogs of JANUVIA (sitagliptin phosphate). Bioorg Med Chem Lett17:3373-7 (2007) 
 
Dipeptidyl peptidase 9
Name:Dipeptidyl peptidase 9
Type:Enzyme
Mol. Mass.:98260.70
Organism:Homo sapiens (Human)
Description:Q86TI2
Residue:863
BDBM50210647
NameBDBM50210647
Synonyms:(R)-3-amino-1-(3-cyclopropyl-5,6-dihydro-[1,2,4]triazolo[4,3-a]pyrazin-7(8H)-yl)-4-(2,4,5-trifluorophenyl)butan-1-one | CHEMBL390239
TypeSmall organic molecule
Emp. Form.C18H20F3N5O
Mol. Mass.379.3795
SMILESN[C@@H](CC(=O)N1CCn2c(C1)nnc2C1CC1)Cc1cc(F)c(F)cc1F