Reaction Details
TargetDipeptidyl peptidase 4
LigandBDBM50210652
Substrate/Competitorn/a
Meas. Tech.ChEMBL_444118 (CHEMBL893277)
IC50 37±n/a nM
Citation Kim, DKowalchick, JEEdmondson, SDMastracchio, AXu, JEiermann, GJLeiting, BWu, JKPryor, KDPatel, RAHe, HLyons, KAThornberry, NAWeber, AE Triazolopiperazine-amides as dipeptidyl peptidase IV inhibitors: close analogs of JANUVIA (sitagliptin phosphate). Bioorg Med Chem Lett17:3373-7 (2007) 
 
Dipeptidyl peptidase 4
Name:Dipeptidyl peptidase 4
Type:Enzyme
Mol. Mass.:88271.01
Organism:Homo sapiens (Human)
Description:P27487
Residue:766
BDBM50210652
NameBDBM50210652
Synonyms:(R)-3-amino-1-(3-ethyl-5,6-dihydro-[1,2,4]triazolo[4,3-a]pyrazin-7(8H)-yl)-4-(2,4,5-trifluorophenyl)butan-1-one | CHEMBL233685
TypeSmall organic molecule
Emp. Form.C17H20F3N5O
Mol. Mass.367.3688
SMILESCCc1nnc2CN(CCn12)C(=O)C[C@H](N)Cc1cc(F)c(F)cc1F