Reaction Details
TargetDipeptidyl peptidase 8
LigandBDBM50210665
Substrate/Competitorn/a
Meas. Tech.ChEMBL_444119 (CHEMBL893278)
IC50 83000±n/a nM
Citation Kim, DKowalchick, JEEdmondson, SDMastracchio, AXu, JEiermann, GJLeiting, BWu, JKPryor, KDPatel, RAHe, HLyons, KAThornberry, NAWeber, AE Triazolopiperazine-amides as dipeptidyl peptidase IV inhibitors: close analogs of JANUVIA (sitagliptin phosphate). Bioorg Med Chem Lett17:3373-7 (2007) 
 
Dipeptidyl peptidase 8
Name:Dipeptidyl peptidase 8
Type:Enzyme
Mol. Mass.:103342.62
Organism:Homo sapiens (Human)
Description:Q6V1X1
Residue:898
BDBM50210665
NameBDBM50210665
Synonyms:(R)-3-amino-4-(2,4-difluorophenyl)-1-(3-(trifluoromethyl)-5,6-dihydro-[1,2,4]triazolo[4,3-a]pyrazin-7(8H)-yl)butan-1-one | CHEMBL389151
TypeSmall organic molecule
Emp. Form.C16H16F5N5O
Mol. Mass.389.3232
SMILESN[C@@H](CC(=O)N1CCn2c(C1)nnc2C(F)(F)F)Cc1ccc(F)cc1F