Reaction Details
TargetDipeptidyl peptidase 8
LigandBDBM50210668
Substrate/Competitorn/a
Meas. Tech.ChEMBL_444119 (CHEMBL893278)
IC50 1010±n/a nM
Citation Kim, DKowalchick, JEEdmondson, SDMastracchio, AXu, JEiermann, GJLeiting, BWu, JKPryor, KDPatel, RAHe, HLyons, KAThornberry, NAWeber, AE Triazolopiperazine-amides as dipeptidyl peptidase IV inhibitors: close analogs of JANUVIA (sitagliptin phosphate). Bioorg Med Chem Lett17:3373-7 (2007) 
 
Dipeptidyl peptidase 8
Name:Dipeptidyl peptidase 8
Type:Enzyme
Mol. Mass.:103342.62
Organism:Homo sapiens (Human)
Description:Q6V1X1
Residue:898
BDBM50210668
NameBDBM50210668
Synonyms:(3R)-3-amino-4-(2,5-difluorophenyl)-1-(3-(2,4-difluorophenyl)-5,6-dihydro-[1,2,4]triazolo[4,3-a]pyrazin-7(8H)-yl)butan-1-one | CHEMBL389599
TypeSmall organic molecule
Emp. Form.C21H19F4N5O
Mol. Mass.433.4021
SMILESN[C@@H](CC(=O)N1CCn2c(C1)nnc2-c1ccc(F)cc1F)Cc1cc(F)ccc1F