Reaction Details
TargetDipeptidyl peptidase 4
LigandBDBM50210654
Substrate/Competitorn/a
Meas. Tech.ChEMBL_444118 (CHEMBL893277)
IC50 1018±n/a nM
Citation Kim, DKowalchick, JEEdmondson, SDMastracchio, AXu, JEiermann, GJLeiting, BWu, JKPryor, KDPatel, RAHe, HLyons, KAThornberry, NAWeber, AE Triazolopiperazine-amides as dipeptidyl peptidase IV inhibitors: close analogs of JANUVIA (sitagliptin phosphate). Bioorg Med Chem Lett17:3373-7 (2007) 
 
Dipeptidyl peptidase 4
Name:Dipeptidyl peptidase 4
Type:Enzyme
Mol. Mass.:88271.01
Organism:Homo sapiens (Human)
Description:P27487
Residue:766
BDBM50210654
NameBDBM50210654
Synonyms:(R)-3-amino-4-(perfluorophenyl)-1-(3-(trifluoromethyl)-5,6-dihydro-[1,2,4]triazolo[4,3-a]pyrazin-7(8H)-yl)butan-1-one | CHEMBL397743
TypeSmall organic molecule
Emp. Form.C16H13F8N5O
Mol. Mass.443.2945
SMILESN[C@@H](CC(=O)N1CCn2c(C1)nnc2C(F)(F)F)Cc1c(F)c(F)c(F)c(F)c1F