Reaction Details
TargetAlpha-1A adrenergic receptor
LigandBDBM50060964
Substrate/Competitorn/a
Meas. Tech.ChEMBL_444276 (CHEMBL894516)
Ki 0.19±n/a nM
Citation Chiu, GLi, SConnolly, PJPulito, VLiu, JMiddleton, SA (Arylpiperazinyl)cyclohexylsufonamides: discovery of alpha(1a/1d)-selective adrenergic receptor antagonists for the treatment of Benign Prostatic Hyperplasia/Lower Urinary Tract Symptoms (BPH/LUTS). Bioorg Med Chem Lett17:3292-7 (2007) 
 
Alpha-1A adrenergic receptor
Name:Alpha-1A adrenergic receptor
Type:Cell-surface receptors
Mol. Mass.:51511.67
Organism:Homo sapiens (Human)
Description:P35348
Residue:466
BDBM50060964
NameBDBM50060964
Synonyms:(R)-5-(2-((2-(2-ethoxyphenoxy)ethyl)amino)propyl)-2-methoxybenzenesulfonamide 5-[2-[2-(2-ethoxyphenoxy)ethylamino]propyl]-2-methoxy-benzenesulfonamide TAMSULOSIN
TypeSmall organic molecule
Emp. Form.C20H28N2O5S
Mol. Mass.408.512
SMILESCCOc1ccccc1OCCN[C@H](C)Cc1ccc(OC)c(c1)S(N)(=O)=O