Reaction Details
TargetAlpha-1A adrenergic receptor
LigandBDBM50211345
Substrate/Competitorn/a
Meas. Tech.ChEMBL_444276 (CHEMBL894516)
Ki 1±n/a nM
Citation Chiu, GLi, SConnolly, PJPulito, VLiu, JMiddleton, SA (Arylpiperazinyl)cyclohexylsufonamides: discovery of alpha(1a/1d)-selective adrenergic receptor antagonists for the treatment of Benign Prostatic Hyperplasia/Lower Urinary Tract Symptoms (BPH/LUTS). Bioorg Med Chem Lett17:3292-7 (2007) 
 
Alpha-1A adrenergic receptor
Name:Alpha-1A adrenergic receptor
Type:Cell-surface receptors
Mol. Mass.:51511.67
Organism:Homo sapiens (Human)
Description:P35348
Residue:466
BDBM50211345
NameBDBM50211345
Synonyms:CHEMBL232593 | N-((1r,4r)-4-(4-(2-isopropoxyphenyl)piperazin-1-yl)cyclohexyl)-2-nitrobenzenesulfonamide
TypeSmall organic molecule
Emp. Form.C25H34N4O5S
Mol. Mass.502.626
SMILESCC(C)Oc1ccccc1N1CCN(CC1)[C@H]1CC[C@@H](CC1)NS(=O)(=O)c1ccccc1[N+]([O-])=O