Reaction Details
TargetAlpha-1D adrenergic receptor
LigandBDBM50211341
Substrate/Competitorn/a
Meas. Tech.ChEMBL_444278 (CHEMBL894518)
Ki 0.14±n/a nM
Citation Chiu, GLi, SConnolly, PJPulito, VLiu, JMiddleton, SA (Arylpiperazinyl)cyclohexylsufonamides: discovery of alpha(1a/1d)-selective adrenergic receptor antagonists for the treatment of Benign Prostatic Hyperplasia/Lower Urinary Tract Symptoms (BPH/LUTS). Bioorg Med Chem Lett17:3292-7 (2007) 
 
Alpha-1D adrenergic receptor
Name:Alpha-1D adrenergic receptor
Type:Enzyme Catalytic Domain
Mol. Mass.:60485.82
Organism:Homo sapiens (Human)
Description:adrenergic Alpha1D ADRA1D HUMAN::P25100
Residue:572
BDBM50211341
NameBDBM50211341
Synonyms:5-bromo-6-chloro-N-((1s,4s)-4-(4-(2-isopropoxyphenyl)piperazin-1-yl)cyclohexyl)pyridine-3-sulfonamide | CHEMBL232609
TypeSmall organic molecule
Emp. Form.C24H32BrClN4O3S
Mol. Mass.571.958
SMILESCC(C)Oc1ccccc1N1CCN(CC1)[C@@H]1CC[C@@H](CC1)NS(=O)(=O)c1cnc(Cl)c(Br)c1