Reaction Details
TargetGlutamate receptor 3
LigandBDBM50166285
Substrate/Competitorn/a
Meas. Tech.ChEMBL_435004 (CHEMBL920255)
Ki 1.2±n/a nM
Citation Vogensen, SBFrydenvang, KGreenwood, JRPostorino, GNielsen, BPickering, DSEbert, BBølcho, UEgebjerg, JGajhede, MKastrup, JSJohansen, TNClausen, RPKrogsgaard-Larsen, P A tetrazolyl-substituted subtype-selective AMPA receptor agonist. J Med Chem50:2408-14 (2007) 
 
Glutamate receptor 3
Name:Glutamate receptor 3
Type:Enzyme Catalytic Domain
Mol. Mass.:100383.57
Organism:RAT
Description:Glutamate-AMPA GRIA3 RAT::P19492
Residue:888
BDBM50166285
NameBDBM50166285
Synonyms:(RS)-2-amino-3-[3-hydroxy-5-(2-propyl-2H-5-tetrazolyl)-4-isoxazolyl]propionic acid 2-amino-3-(3-hydroxy-5-(2-propyl-2H-tetrazol-5-yl)isoxazol-4-yl)propanoic acid | CHEMBL372643
TypeSmall organic molecule
Emp. Form.C10H14N6O4
Mol. Mass.282.256
SMILESCCCn1nnc(n1)-c1o[nH]c(=O)c1CC(N)C(O)=O