Reaction Details
TargetC-X-C chemokine receptor type 1
LigandBDBM50211456
Substrate/Competitorn/a
Meas. Tech.ChEMBL_455596 (CHEMBL886376)
Ki 50±n/a nM
Citation Chao, JTaveras, AGChao, JAki, CDwyer, MYu, YPurakkattle, BRindgen, DJakway, JHipkin, WFosetta, JFan, XLundell, DFine, JMinnicozzi, MPhillips, JMerritt, JR C(4)-alkyl substituted furanyl cyclobutenediones as potent, orally bioavailable CXCR2 and CXCR1 receptor antagonists. Bioorg Med Chem Lett17:3778-83 (2007) 
 
C-X-C chemokine receptor type 1
Name:C-X-C chemokine receptor type 1
Type:Enzyme
Mol. Mass.:39803.83
Organism:Homo sapiens (Human)
Description:P25024
Residue:350
BDBM50211456
NameBDBM50211456
Synonyms:(R)-2-hydroxy-3-(2-(1-(4-isopropylfuran-2-yl)ethylamino)-3,4-dioxocyclobut-1-enylamino)-N,N-dimethylbenzamide | CHEMBL246941
TypeSmall organic molecule
Emp. Form.C22H25N3O5
Mol. Mass.411.451
SMILESCC(C)c1coc(c1)[C@@H](C)Nc1c(Nc2cccc(C(=O)N(C)C)c2O)c(=O)c1=O