Reaction Details
TargetLysophosphatidic acid receptor 1
LigandBDBM50211652
Substrate/Competitorn/a
Meas. Tech.ChEMBL_455638 (CHEMBL903636)
IC50>20000±n/a nM
Citation Yamamoto, TFujita, KAsari, SChiba, AKataba, YOhsumi, KOhmuta, NIida, YIjichi, CIwayama, SFukuchi, NShoji, M Synthesis and evaluation of isoxazole derivatives as lysophosphatidic acid (LPA) antagonists. Bioorg Med Chem Lett17:3736-40 (2007) 
 
Lysophosphatidic acid receptor 1
Name:Lysophosphatidic acid receptor 1
Type:PROTEIN
Mol. Mass.:41130.42
Organism:Rattus norvegicus
Description:ChEMBL_329844
Residue:364
BDBM50211652
NameBDBM50211652
Synonyms:3-{2'-[1-(2-chloro-phenyl)-ethoxycarbonylamino]-biphenyl-4-ylmethylsulfanyl}-propionic acid | CHEMBL245895
TypeSmall organic molecule
Emp. Form.C25H24ClNO4S
Mol. Mass.469.98
SMILESCC(OC(=O)Nc1ccccc1-c1ccc(CSCCC(O)=O)cc1)c1ccccc1Cl