Reaction Details
TargetIsoform 1 of Steroid hormone receptor ERR2 (ERRbeta2-delta10)
LigandBDBM50212162
Substrate/Competitorn/a
Meas. Tech.ChEMBL_455656 (CHEMBL886439)
IC50 641±n/a nM
Citation Vu, ATCampbell, ANHarris, HAUnwalla, RJManas, ESMewshaw, RE ERbeta ligands. Part 6: 6H-Chromeno[4,3-b]quinolines as a new series of estrogen receptor beta-selective ligands. Bioorg Med Chem Lett17:4053-6 (2007) 
 
Isoform 1 of Steroid hormone receptor ERR2 (ERRbeta2-delta10)
Name:Isoform 1 of Steroid hormone receptor ERR2 (ERRbeta2-delta10)
Type:PROTEIN
Mol. Mass.:56220.72
Organism:Homo sapiens (Human)
Description:ChEMBL_940755
Residue:508
BDBM50212162
NameBDBM50212162
Synonyms:7-ethyl-6H-chromeno[4,3-b]quinoline-3,9-diol | CHEMBL402493
TypeSmall organic molecule
Emp. Form.C18H15NO3
Mol. Mass.293.3166
SMILESCCc1c2COc3cc(O)ccc3-c2nc2ccc(O)cc12