Reaction Details
TargetIsoform 1 of Steroid hormone receptor ERR2 (ERRbeta2-delta10)
LigandBDBM50171726
Substrate/Competitorn/a
Meas. Tech.ChEMBL_455656 (CHEMBL886439)
IC50 213±n/a nM
Citation Vu, ATCampbell, ANHarris, HAUnwalla, RJManas, ESMewshaw, RE ERbeta ligands. Part 6: 6H-Chromeno[4,3-b]quinolines as a new series of estrogen receptor beta-selective ligands. Bioorg Med Chem Lett17:4053-6 (2007) 
 
Isoform 1 of Steroid hormone receptor ERR2 (ERRbeta2-delta10)
Name:Isoform 1 of Steroid hormone receptor ERR2 (ERRbeta2-delta10)
Type:PROTEIN
Mol. Mass.:56220.72
Organism:Homo sapiens (Human)
Description:ChEMBL_940755
Residue:508
BDBM50171726
NameBDBM50171726
Synonyms:4-Chloro-2-(4-hydroxy-phenyl)-quinolin-6-ol CHEMBL372783
TypeSmall organic molecule
Emp. Form.C15H10ClNO2
Mol. Mass.271.698
SMILESOc1ccc(cc1)-c1cc(Cl)c2cc(O)ccc2n1