Reaction Details
TargetIsoform 1 of Steroid hormone receptor ERR2 (ERRbeta2-delta10)
LigandBDBM19459
Substrate/Competitorn/a
Meas. Tech.ChEMBL_455656 (CHEMBL886439)
IC50 395±n/a nM
Citation Vu, ATCampbell, ANHarris, HAUnwalla, RJManas, ESMewshaw, RE ERbeta ligands. Part 6: 6H-Chromeno[4,3-b]quinolines as a new series of estrogen receptor beta-selective ligands. Bioorg Med Chem Lett17:4053-6 (2007) 
 
Isoform 1 of Steroid hormone receptor ERR2 (ERRbeta2-delta10)
Name:Isoform 1 of Steroid hormone receptor ERR2 (ERRbeta2-delta10)
Type:PROTEIN
Mol. Mass.:56220.72
Organism:Homo sapiens (Human)
Description:ChEMBL_940755
Residue:508
BDBM19459
NameBDBM19459
Synonyms:5,7-dihydroxy-3-(4-hydroxyphenyl)-4H-chromen-4-one Genistein Genisteol US8552057, 2 | cid_5280961
TypePhytoestrogen
Emp. Form.C15H10O5
Mol. Mass.270.2369
SMILESOc1ccc(cc1)-c1coc2cc(O)cc(O)c2c1=O