Reaction Details
TargetIsoform 1 of Steroid hormone receptor ERR2 (ERRbeta2-delta10)
LigandBDBM50212172
Substrate/Competitorn/a
Meas. Tech.ChEMBL_455656 (CHEMBL886439)
IC50 98±n/a nM
Citation Vu, ATCampbell, ANHarris, HAUnwalla, RJManas, ESMewshaw, RE ERbeta ligands. Part 6: 6H-Chromeno[4,3-b]quinolines as a new series of estrogen receptor beta-selective ligands. Bioorg Med Chem Lett17:4053-6 (2007) 
 
Isoform 1 of Steroid hormone receptor ERR2 (ERRbeta2-delta10)
Name:Isoform 1 of Steroid hormone receptor ERR2 (ERRbeta2-delta10)
Type:PROTEIN
Mol. Mass.:56220.72
Organism:Homo sapiens (Human)
Description:ChEMBL_940755
Residue:508
BDBM50212172
NameBDBM50212172
Synonyms:3,9-dihydroxy-6H-chromeno[4,3-b]quinoline-7-carbonitrile | CHEMBL402492
TypeSmall organic molecule
Emp. Form.C17H10N2O3
Mol. Mass.290.2729
SMILESOc1ccc-2c(OCc3c-2nc2ccc(O)cc2c3C#N)c1