Reaction Details
TargetKappa-type opioid receptor
LigandBDBM50212297
Substrate/Competitorn/a
Meas. Tech.ChEMBL_436582 (CHEMBL904890)
EC50 2.6±n/a nM
Citation Zhang, ALi, FDing, CYao, QKnapp, BIBidlack, JMNeumeyer, JL Synthesis and pharmacological evaluation of 6,7-indolo/thiazolo-morphinans--further SAR of levorphanol. J Med Chem50:2747-51 (2007) 
 
Kappa-type opioid receptor
Name:Kappa-type opioid receptor
Type:G Protein-Coupled Receptor (GPCR)
Mol. Mass.:42648.76
Organism:Homo sapiens (Human)
Description:P41145
Residue:380
BDBM50212297
NameBDBM50212297
Synonyms:(1S,9R,10R)-5-amino-20-(cyclobutylmethyl)-6-thia-4,20-diazapentacyclo[8.7.3.0^{1,9}.0^{3,7}.0^{12,17}]icosa-3(7),4,12(17),13,15-pentaen-15-ol | CHEMBL376355
TypeSmall organic molecule
Emp. Form.C22H27N3OS
Mol. Mass.381.534
SMILESNc1nc2C[C@]34CCN(CC5CCC5)[C@H](Cc5ccc(O)cc35)[C@@H]4Cc2s1