Reaction Details
TargetKappa-type opioid receptor
LigandBDBM50212299
Substrate/Competitorn/a
Meas. Tech.ChEMBL_436577 (CHEMBL904885)
Ki 2.2±n/a nM
Citation Zhang, ALi, FDing, CYao, QKnapp, BIBidlack, JMNeumeyer, JL Synthesis and pharmacological evaluation of 6,7-indolo/thiazolo-morphinans--further SAR of levorphanol. J Med Chem50:2747-51 (2007) 
 
Kappa-type opioid receptor
Name:Kappa-type opioid receptor
Type:G Protein-Coupled Receptor (GPCR)
Mol. Mass.:42648.76
Organism:Homo sapiens (Human)
Description:P41145
Residue:380
BDBM50212299
NameBDBM50212299
Synonyms:(1S,9R,10R)-5-amino-20-methyl-6-thia-4,20-diazapentacyclo[8.7.3.0^{1,9}.0^{3,7}.0^{12,17}]icosa-3(7),4,12(17),13,15-pentaen-15-ol US10766864, Example 90
TypeSmall organic molecule
Emp. Form.C18H21N3OS
Mol. Mass.327.444
SMILESCN1CC[C@]23Cc4nc(N)sc4C[C@H]2[C@H]1Cc1ccc(O)cc31