Reaction Details
TargetDelta-type opioid receptor
LigandBDBM50212296
Substrate/Competitorn/a
Meas. Tech.ChEMBL_436584 (CHEMBL904892)
EC50 0.160000±n/a nM
Citation Zhang, ALi, FDing, CYao, QKnapp, BIBidlack, JMNeumeyer, JL Synthesis and pharmacological evaluation of 6,7-indolo/thiazolo-morphinans--further SAR of levorphanol. J Med Chem50:2747-51 (2007) 
 
Delta-type opioid receptor
Name:Delta-type opioid receptor
Type:G Protein-Coupled Receptor (GPCR)
Mol. Mass.:40382.98
Organism:Homo sapiens (Human)
Description:Competition binding assays were carried out using membrane preparations from transfected HN9.10 cells that constitutively expressed the delta opioid receptor.
Residue:372
BDBM50212296
NameBDBM50212296
Synonyms:(1S,13R,14R)-24-(cyclopropylmethyl)-4,24-diazahexacyclo[12.7.3.0^{1,13}.0^{3,11}.0^{5,10}.0^{16,21}]tetracosa-3(11),5(10),6,8,16(21),17,19-heptaen-19-ol | CHEMBL226166
TypeSmall organic molecule
Emp. Form.C26H28N2O
Mol. Mass.384.5133
SMILESOc1ccc2C[C@@H]3[C@@H]4Cc5c(C[C@]4(CCN3CC3CC3)c2c1)[nH]c1ccccc51