Reaction Details
TargetMu-type opioid receptor
LigandBDBM50212610
Substrate/Competitorn/a
Meas. Tech.ChEMBL_436682 (CHEMBL904991)
Ki 0.44±n/a nM
Citation Li, TShiotani, KMiyazaki, ATsuda, YAmbo, ASasaki, YJinsmaa, YMarczak, EBryant, SDLazarus, LHOkada, Y Bifunctional [2',6'-dimethyl-L-tyrosine1]endomorphin-2 analogues substituted at position 3 with alkylated phenylalanine derivatives yield potent mixed mu-agonist/delta-antagonist and dual mu-agonist/delta-agonist opioid ligands. J Med Chem50:2753-66 (2007) 
 
Mu-type opioid receptor
Name:Mu-type opioid receptor
Type:G Protein-Coupled Receptor (GPCR)
Mol. Mass.:44503.11
Organism:Rattus norvegicus (rat)
Description:Competition binding assays were carried out using membrane preparations from transfected HN9.10 cells that constitutively expressed the mu opioid receptor.
Residue:398
BDBM50212610
NameBDBM50212610
Synonyms:CHEMBL389023 | Tyr-Pro-Tmp-Phe-NH
TypeSmall organic molecule
Emp. Form.C35H43N5O5
Mol. Mass.613.7464
SMILESCc1cc(C)c(C[C@H](NC(=O)[C@@H]2CCCN2C(=O)[C@@H](N)Cc2ccc(O)cc2)C(=O)N[C@@H](Cc2ccccc2)C(N)=O)c(C)c1