Reaction Details
TargetTyrosine-protein kinase ITK/TSK
LigandBDBM50212761
Substrate/Competitorn/a
Meas. Tech.ChEMBL_447339 (CHEMBL896373)
IC50 62±n/a nM
Citation Snow, RJAbeywardane, ACampbell, SLord, JKashem, MAKhine, HHKing, JKowalski, JAPullen, SSRoma, TRoth, GPSarko, CRWilson, NSWinters, MPWolak, JPCywin, CL Hit-to-lead studies on benzimidazole inhibitors of ITK: discovery of a novel class of kinase inhibitors. Bioorg Med Chem Lett17:3660-5 (2007) 
 
Tyrosine-protein kinase ITK/TSK
Name:Tyrosine-protein kinase ITK/TSK
Type:Protein
Mol. Mass.:71839.20
Organism:Homo sapiens (Human)
Description:Q08881
Residue:620
BDBM50212761
NameBDBM50212761
Synonyms:1-(3-amino-3-oxopropyl)-N-cyclohexyl-N-methyl-2-(oxazole-5-carboxamido)-1H-benzo[d]imidazole-5-carboxamide | CHEMBL231747
TypeSmall organic molecule
Emp. Form.C22H26N6O4
Mol. Mass.438.4796
SMILESCN(C1CCCCC1)C(=O)c1ccc2n(CCC(N)=O)c(NC(=O)c3cnco3)nc2c1