Reaction Details
TargetCannabinoid receptor 1
LigandBDBM50213471
Substrate/Competitorn/a
Meas. Tech.ChEMBL_456127 (CHEMBL887035)
Ki 105±n/a nM
Citation Ellsworth, BAWang, YZhu, YPendri, AGerritz, SWSun, CCarlson, KEKang, LBaska, RAYang, YHuang, QBurford, NTCullen, MJJohnghar, SBehnia, KPelleymounter, MAWashburn, WNEwing, WR Discovery of pyrazine carboxamide CB1 antagonists: the introduction of a hydroxyl group improves the pharmaceutical properties and in vivo efficacy of the series. Bioorg Med Chem Lett17:3978-82 (2007) 
 
Cannabinoid receptor 1
Name:Cannabinoid receptor 1
Type:G Protein-Coupled Receptor (GPCR)
Mol. Mass.:52868.96
Organism:Homo sapiens (Human)
Description:P21554
Residue:472
BDBM50213471
NameBDBM50213471
Synonyms:(S)-N-(1-amino-4-methyl-1-oxopentan-2-yl)-5,6-dip-tolylpyrazine-2-carboxamide | CHEMBL247553
TypeSmall organic molecule
Emp. Form.C25H28N4O2
Mol. Mass.416.5154
SMILESCC(C)C[C@H](NC(=O)c1cnc(-c2ccc(C)cc2)c(n1)-c1ccc(C)cc1)C(N)=O