Reaction Details
TargetCannabinoid receptor 1
LigandBDBM50213473
Substrate/Competitorn/a
Meas. Tech.ChEMBL_456127 (CHEMBL887035)
Ki 300±n/a nM
Citation Ellsworth, BAWang, YZhu, YPendri, AGerritz, SWSun, CCarlson, KEKang, LBaska, RAYang, YHuang, QBurford, NTCullen, MJJohnghar, SBehnia, KPelleymounter, MAWashburn, WNEwing, WR Discovery of pyrazine carboxamide CB1 antagonists: the introduction of a hydroxyl group improves the pharmaceutical properties and in vivo efficacy of the series. Bioorg Med Chem Lett17:3978-82 (2007) 
 
Cannabinoid receptor 1
Name:Cannabinoid receptor 1
Type:G Protein-Coupled Receptor (GPCR)
Mol. Mass.:52868.96
Organism:Homo sapiens (Human)
Description:P21554
Residue:472
BDBM50213473
NameBDBM50213473
Synonyms:CHEMBL397387 | N-((1R,2S)-2-hydroxycyclohexyl)-5,6-dip-tolylpyrazine-2-carboxamide
TypeSmall organic molecule
Emp. Form.C25H27N3O2
Mol. Mass.401.5008
SMILESCc1ccc(cc1)-c1ncc(nc1-c1ccc(C)cc1)C(=O)N[C@@H]1CCCC[C@@H]1O