Reaction Details
TargetCannabinoid receptor 1
LigandBDBM50213477
Substrate/Competitorn/a
Meas. Tech.ChEMBL_456127 (CHEMBL887035)
Ki 39±n/a nM
Citation Ellsworth, BAWang, YZhu, YPendri, AGerritz, SWSun, CCarlson, KEKang, LBaska, RAYang, YHuang, QBurford, NTCullen, MJJohnghar, SBehnia, KPelleymounter, MAWashburn, WNEwing, WR Discovery of pyrazine carboxamide CB1 antagonists: the introduction of a hydroxyl group improves the pharmaceutical properties and in vivo efficacy of the series. Bioorg Med Chem Lett17:3978-82 (2007) 
 
Cannabinoid receptor 1
Name:Cannabinoid receptor 1
Type:G Protein-Coupled Receptor (GPCR)
Mol. Mass.:52868.96
Organism:Homo sapiens (Human)
Description:P21554
Residue:472
BDBM50213477
NameBDBM50213477
Synonyms:CHEMBL247516 | N-(1-(2,6-dimethylphenoxy)propan-2-yl)-5,6-dip-tolylpyrazine-2-carboxamide
TypeSmall organic molecule
Emp. Form.C30H31N3O2
Mol. Mass.465.586
SMILESCC(COc1c(C)cccc1C)NC(=O)c1cnc(-c2ccc(C)cc2)c(n1)-c1ccc(C)cc1