Reaction Details
TargetCannabinoid receptor 1
LigandBDBM50213478
Substrate/Competitorn/a
Meas. Tech.ChEMBL_456127 (CHEMBL887035)
Ki 33±n/a nM
Citation Ellsworth, BAWang, YZhu, YPendri, AGerritz, SWSun, CCarlson, KEKang, LBaska, RAYang, YHuang, QBurford, NTCullen, MJJohnghar, SBehnia, KPelleymounter, MAWashburn, WNEwing, WR Discovery of pyrazine carboxamide CB1 antagonists: the introduction of a hydroxyl group improves the pharmaceutical properties and in vivo efficacy of the series. Bioorg Med Chem Lett17:3978-82 (2007) 
 
Cannabinoid receptor 1
Name:Cannabinoid receptor 1
Type:G Protein-Coupled Receptor (GPCR)
Mol. Mass.:52868.96
Organism:Homo sapiens (Human)
Description:P21554
Residue:472
BDBM50213478
NameBDBM50213478
Synonyms:CHEMBL245467 | N-(1-hydroxy-2,3-dihydro-1H-inden-2-yl)-5,6-dip-tolylpyrazine-2-carboxamide
TypeSmall organic molecule
Emp. Form.C28H25N3O2
Mol. Mass.435.517
SMILESCc1ccc(cc1)-c1ncc(nc1-c1ccc(C)cc1)C(=O)NC1Cc2ccccc2C1O