Reaction Details
TargetTyrosine-protein phosphatase non-receptor type 1
LigandBDBM50213490
Substrate/Competitorn/a
Meas. Tech.ChEMBL_447477 (CHEMBL896500)
IC50 17500±n/a nM
Citation Na, MHoang, DMNjamen, DMbafor, JTFomum, ZTThuong, PTAhn, JSOh, WK Inhibitory effect of 2-arylbenzofurans from Erythrina addisoniae on protein tyrosine phosphatase-1B. Bioorg Med Chem Lett17:3868-71 (2007) 
 
Tyrosine-protein phosphatase non-receptor type 1
Name:Tyrosine-protein phosphatase non-receptor type 1
Type:Protein phosphatase
Mol. Mass.:49963.76
Organism:Homo sapiens (Human)
Description:Human recombinant GST-fusion PTP1B (1-435).
Residue:435
BDBM50213490
NameBDBM50213490
Synonyms:2-[2'-methoxy-4'-hydroxy-5'-(3-methylbut-2-enyl)phenyl]-6-hydroxybenzofuran | CHEMBL233142
TypeSmall organic molecule
Emp. Form.C20H20O4
Mol. Mass.324.3704
SMILES[#6]-[#8]-c1cc(-[#8])c(-[#6]\[#6]=[#6](\[#6])-[#6])cc1-c1cc2ccc(-[#8])cc2o1