Reaction Details
TargetTyrosine-protein phosphatase non-receptor type 1
LigandBDBM50213495
Substrate/Competitorn/a
Meas. Tech.ChEMBL_447477 (CHEMBL896500)
IC50 74100±n/a nM
Citation Na, MHoang, DMNjamen, DMbafor, JTFomum, ZTThuong, PTAhn, JSOh, WK Inhibitory effect of 2-arylbenzofurans from Erythrina addisoniae on protein tyrosine phosphatase-1B. Bioorg Med Chem Lett17:3868-71 (2007) 
 
Tyrosine-protein phosphatase non-receptor type 1
Name:Tyrosine-protein phosphatase non-receptor type 1
Type:Protein phosphatase
Mol. Mass.:49963.76
Organism:Homo sapiens (Human)
Description:Human recombinant GST-fusion PTP1B (1-435).
Residue:435
BDBM50213495
NameBDBM50213495
Synonyms:3-methoxy-4-(6-methoxybenzofuran-2-yl)phenol | CHEMBL233767
TypeSmall organic molecule
Emp. Form.C16H14O4
Mol. Mass.270.28
SMILESCOc1ccc2cc(oc2c1)-c1ccc(O)cc1OC