Reaction Details
TargetCannabinoid receptor 2
LigandBDBM50121428
Substrate/Competitorn/a
Meas. Tech.ChEMBL_459064 (CHEMBL925156)
Ki 1.03±n/a nM
Citation Durdagi, SKapou, AKourouli, TAndreou, TNikas, SPNahmias, VRPapahatjis, DPPapadopoulos, MGMavromoustakos, T The application of 3D-QSAR studies for novel cannabinoid ligands substituted at the C1' position of the alkyl side chain on the structural requirements for binding to cannabinoid receptors CB1 and CB2. J Med Chem50:2875-85 (2007) 
 
Cannabinoid receptor 2
Name:Cannabinoid receptor 2
Type:G Protein-Coupled Receptor (GPCR)
Mol. Mass.:39690.94
Organism:Homo sapiens (Human)
Description:P34972
Residue:360
BDBM50121428
NameBDBM50121428
Synonyms:(6aR,10aR)-3-(2,2-Dibromo-1-hexyl-cyclopropyl)-6,6,9-trimethyl-6a,7,10,10a-tetrahydro-6H-benzo[c]chromen-1-ol CHEMBL118631
TypeSmall organic molecule
Emp. Form.C25H34Br2O2
Mol. Mass.526.344
SMILESCCCCCCC1(CC1(Br)Br)c1cc(O)c2[C@@H]3CC(C)=CC[C@H]3C(C)(C)Oc2c1