Reaction Details
TargetCannabinoid receptor 2
LigandBDBM50213595
Substrate/Competitorn/a
Meas. Tech.ChEMBL_459064 (CHEMBL925156)
Ki 50.4±n/a nM
Citation Durdagi, SKapou, AKourouli, TAndreou, TNikas, SPNahmias, VRPapahatjis, DPPapadopoulos, MGMavromoustakos, T The application of 3D-QSAR studies for novel cannabinoid ligands substituted at the C1' position of the alkyl side chain on the structural requirements for binding to cannabinoid receptors CB1 and CB2. J Med Chem50:2875-85 (2007) 
 
Cannabinoid receptor 2
Name:Cannabinoid receptor 2
Type:G Protein-Coupled Receptor (GPCR)
Mol. Mass.:39690.94
Organism:Homo sapiens (Human)
Description:P34972
Residue:360
BDBM50213595
NameBDBM50213595
Synonyms:5-(2-hexyl-1,3-dithiolan-2-yl)-2-((1R)-3-methyl-6-(prop-1-en-2-yl)cyclohex-2-enyl)benzene-1,3-diol CHEMBL239208
TypeSmall organic molecule
Emp. Form.C25H36O2S2
Mol. Mass.432.682
SMILESCCCCCCC1(SCCS1)c1cc(O)c([C@@H]2C=C(C)CCC2C(C)=C)c(O)c1