Reaction Details
TargetCannabinoid receptor 1
LigandBDBM50213596
Substrate/Competitorn/a
Meas. Tech.ChEMBL_459063 (CHEMBL925155)
Ki 666.4±n/a nM
Citation Durdagi, SKapou, AKourouli, TAndreou, TNikas, SPNahmias, VRPapahatjis, DPPapadopoulos, MGMavromoustakos, T The application of 3D-QSAR studies for novel cannabinoid ligands substituted at the C1' position of the alkyl side chain on the structural requirements for binding to cannabinoid receptors CB1 and CB2. J Med Chem50:2875-85 (2007) 
 
Cannabinoid receptor 1
Name:Cannabinoid receptor 1
Type:G Protein-Coupled Receptor (GPCR)
Mol. Mass.:52868.96
Organism:Homo sapiens (Human)
Description:P21554
Residue:472
BDBM50213596
NameBDBM50213596
Synonyms:5-(2,2-dichloro-1-hexyl-cyclopropyl)-2-((R)-6-isopropenyl-3-methyl-cyclohex-2-enyl)-benzene-1,3-diol CHEMBL238972
TypeSmall organic molecule
Emp. Form.C25H34Cl2O2
Mol. Mass.437.442
SMILESCCCCCCC1(CC1(Cl)Cl)c1cc(O)c([C@@H]2C=C(C)CCC2C(C)=C)c(O)c1