Reaction Details
TargetCannabinoid receptor 2
LigandBDBM50213598
Substrate/Competitorn/a
Meas. Tech.ChEMBL_459064 (CHEMBL925156)
Ki 221.6±n/a nM
Citation Durdagi, SKapou, AKourouli, TAndreou, TNikas, SPNahmias, VRPapahatjis, DPPapadopoulos, MGMavromoustakos, T The application of 3D-QSAR studies for novel cannabinoid ligands substituted at the C1' position of the alkyl side chain on the structural requirements for binding to cannabinoid receptors CB1 and CB2. J Med Chem50:2875-85 (2007) 
 
Cannabinoid receptor 2
Name:Cannabinoid receptor 2
Type:G Protein-Coupled Receptor (GPCR)
Mol. Mass.:39690.94
Organism:Homo sapiens (Human)
Description:P34972
Residue:360
BDBM50213598
NameBDBM50213598
Synonyms:2-((1R)-3-methyl-6-(prop-1-en-2-yl)cyclohex-2-enyl)-5-(naphthalen-1-yl)benzene-1,3-diol CHEMBL238570
TypeSmall organic molecule
Emp. Form.C26H26O2
Mol. Mass.370.4834
SMILESCC(=C)C1CCC(C)=C[C@H]1c1c(O)cc(cc1O)-c1cccc2ccccc12