Reaction Details
TargetCannabinoid receptor 1
LigandBDBM50213609
Substrate/Competitorn/a
Meas. Tech.ChEMBL_459063 (CHEMBL925155)
Ki 2.17±n/a nM
Citation Durdagi, SKapou, AKourouli, TAndreou, TNikas, SPNahmias, VRPapahatjis, DPPapadopoulos, MGMavromoustakos, T The application of 3D-QSAR studies for novel cannabinoid ligands substituted at the C1' position of the alkyl side chain on the structural requirements for binding to cannabinoid receptors CB1 and CB2. J Med Chem50:2875-85 (2007) 
 
Cannabinoid receptor 1
Name:Cannabinoid receptor 1
Type:G Protein-Coupled Receptor (GPCR)
Mol. Mass.:52868.96
Organism:Homo sapiens (Human)
Description:P21554
Residue:472
BDBM50213609
NameBDBM50213609
Synonyms:(6aR,10aR)-6,6,9-trimethyl-3-(oct-1-en-2-yl)-6a,7,10,10a-tetrahydro-6H-benzo[c]chromen-1-ol | CHEMBL239840
TypeSmall organic molecule
Emp. Form.C24H34O2
Mol. Mass.354.5256
SMILESCCCCCCC(=C)c1cc(O)c2[C@@H]3CC(C)=CC[C@H]3C(C)(C)Oc2c1