Reaction Details
TargetCannabinoid receptor 2
LigandBDBM50067730
Substrate/Competitorn/a
Meas. Tech.ChEMBL_459064 (CHEMBL925156)
Ki 3.2±n/a nM
Citation Durdagi, SKapou, AKourouli, TAndreou, TNikas, SPNahmias, VRPapahatjis, DPPapadopoulos, MGMavromoustakos, T The application of 3D-QSAR studies for novel cannabinoid ligands substituted at the C1' position of the alkyl side chain on the structural requirements for binding to cannabinoid receptors CB1 and CB2. J Med Chem50:2875-85 (2007) 
 
Cannabinoid receptor 2
Name:Cannabinoid receptor 2
Type:G Protein-Coupled Receptor (GPCR)
Mol. Mass.:39690.94
Organism:Homo sapiens (Human)
Description:P34972
Residue:360
BDBM50067730
NameBDBM50067730
Synonyms:6-((6aR,10aR)-1-Hydroxy-6,6,9-trimethyl-6a,7,10,10a-tetrahydro-6H-benzo[c]chromen-3-yl)-6-methyl-heptanoic acid piperidin-1-ylamide CHEMBL138772
TypeSmall organic molecule
Emp. Form.C29H44N2O3
Mol. Mass.468.6713
SMILESCC1=CC[C@@H]2[C@@H](C1)c1c(O)cc(cc1OC2(C)C)C(C)(C)CCCCC(=O)NN1CCCCC1