Reaction Details
TargetGonadotropin-releasing hormone receptor
LigandBDBM50213656
Substrate/Competitorn/a
Meas. Tech.ChEMBL_447479 (CHEMBL896502)
Ki 2±n/a nM
Citation Chen, MGuo, ZLanier, MCZhao, LBetz, SFHuang, CQLoweth, CJAshweek, NJLiu, XJStruthers, RSBradbury, MJBehan, JWWen, JO'Brien, ZSaunders, JZhu, YF Identification of 2-(4,5,6,7-tetrahydro-1H-pyrrolo[3,2-c]pyridin-3-yl)-ethylamine derivatives as novel GnRH receptor antagonists. Bioorg Med Chem Lett17:3845-50 (2007) 
 
Gonadotropin-releasing hormone receptor
Name:Gonadotropin-releasing hormone receptor
Type:PROTEIN
Mol. Mass.:37767.60
Organism:Rattus norvegicus
Description:ChEMBL_1335047
Residue:327
BDBM50213656
NameBDBM50213656
Synonyms:(S)-4-(2-(2-(2-(3,5-dimethylphenyl)-5-(2-(2-fluoro-6-(trifluoromethyl)phenyl)acetyl)-4,5,6,7-tetrahydro-1H-pyrrolo[3,2-c]pyridin-3-yl)propylamino)ethyl)benzoic acid | CHEMBL394613
TypeSmall organic molecule
Emp. Form.C36H37F4N3O3
Mol. Mass.635.6909
SMILESC[C@H](CNCCc1ccc(cc1)C(O)=O)c1c2CN(CCc2[nH]c1-c1cc(C)cc(C)c1)C(=O)Cc1c(F)cccc1C(F)(F)F