Reaction Details
TargetGonadotropin-releasing hormone receptor
LigandBDBM50213670
Substrate/Competitorn/a
Meas. Tech.ChEMBL_447478 (CHEMBL896501)
IC50 91±n/a nM
Citation Chen, MGuo, ZLanier, MCZhao, LBetz, SFHuang, CQLoweth, CJAshweek, NJLiu, XJStruthers, RSBradbury, MJBehan, JWWen, JO'Brien, ZSaunders, JZhu, YF Identification of 2-(4,5,6,7-tetrahydro-1H-pyrrolo[3,2-c]pyridin-3-yl)-ethylamine derivatives as novel GnRH receptor antagonists. Bioorg Med Chem Lett17:3845-50 (2007) 
 
Gonadotropin-releasing hormone receptor
Name:Gonadotropin-releasing hormone receptor
Type:Enzyme
Mol. Mass.:37749.45
Organism:Homo sapiens (Human)
Description:P30968
Residue:328
BDBM50213670
NameBDBM50213670
Synonyms:(S)-7-(2-(2-(2-(3,5-dimethylphenyl)-5-(2-(2-fluoro-6-(trifluoromethyl)phenyl)acetyl)-4,5,6,7-tetrahydro-1H-pyrrolo[3,2-c]pyridin-3-yl)propylamino)ethyl)-3-ethylquinazoline-2,4(1H,3H)-dione | CHEMBL232097
TypeSmall organic molecule
Emp. Form.C39H41F4N5O3
Mol. Mass.703.7682
SMILESCCn1c(=O)[nH]c2cc(CCNC[C@@H](C)c3c4CN(CCc4[nH]c3-c3cc(C)cc(C)c3)C(=O)Cc3c(F)cccc3C(F)(F)F)ccc2c1=O