Reaction Details
TargetMelanin-concentrating hormone receptor 1
LigandBDBM50214025
Substrate/Competitorn/a
Meas. Tech.ChEMBL_456228 (CHEMBL888238)
IC50 68±n/a nM
Citation Giordanetto, FKarlsson, OLindberg, JLarsson, LOLinusson, AEvertsson, EMorgan, DGInghardt, T Discovery of cyclopentane- and cyclohexane-trans-1,3-diamines as potent melanin-concentrating hormone receptor 1 antagonists. Bioorg Med Chem Lett17:4232-41 (2007) 
 
Melanin-concentrating hormone receptor 1
Name:Melanin-concentrating hormone receptor 1
Type:G Protein-Coupled Receptor (GPCR)
Mol. Mass.:45976.27
Organism:Homo sapiens (Human)
Description:Membranes from CHO-K1 cells stably expressing human MCH1R were used in assays.
Residue:422
BDBM50214025
NameBDBM50214025
Synonyms:(1S,3S)-N1-(quinolin-2-yl)-N3-(thiophen-3-ylmethyl)cyclohexane-1,3-diamine | CHEMBL250927
TypeSmall organic molecule
Emp. Form.C20H23N3S
Mol. Mass.337.482
SMILESC(N[C@H]1CCC[C@@H](C1)Nc1ccc2ccccc2n1)c1ccsc1