Reaction Details
TargetMelanin-concentrating hormone receptor 1
LigandBDBM50214033
Substrate/Competitorn/a
Meas. Tech.ChEMBL_456228 (CHEMBL888238)
IC50 119±n/a nM
Citation Giordanetto, FKarlsson, OLindberg, JLarsson, LOLinusson, AEvertsson, EMorgan, DGInghardt, T Discovery of cyclopentane- and cyclohexane-trans-1,3-diamines as potent melanin-concentrating hormone receptor 1 antagonists. Bioorg Med Chem Lett17:4232-41 (2007) 
 
Melanin-concentrating hormone receptor 1
Name:Melanin-concentrating hormone receptor 1
Type:G Protein-Coupled Receptor (GPCR)
Mol. Mass.:45976.27
Organism:Homo sapiens (Human)
Description:Membranes from CHO-K1 cells stably expressing human MCH1R were used in assays.
Residue:422
BDBM50214033
NameBDBM50214033
Synonyms:(1S,3S)-N1-(6-methoxy-4-methylquinolin-2-yl)-N3-methyl-N3-(thiophen-3-ylmethyl)cyclopentane-1,3-diamine | CHEMBL250729
TypeSmall organic molecule
Emp. Form.C22H27N3OS
Mol. Mass.381.534
SMILESCOc1ccc2nc(N[C@H]3CC[C@@H](C3)N(C)Cc3ccsc3)cc(C)c2c1