Reaction Details
TargetMelanin-concentrating hormone receptor 1
LigandBDBM50214038
Substrate/Competitorn/a
Meas. Tech.ChEMBL_456228 (CHEMBL888238)
IC50 58±n/a nM
Citation Giordanetto, FKarlsson, OLindberg, JLarsson, LOLinusson, AEvertsson, EMorgan, DGInghardt, T Discovery of cyclopentane- and cyclohexane-trans-1,3-diamines as potent melanin-concentrating hormone receptor 1 antagonists. Bioorg Med Chem Lett17:4232-41 (2007) 
 
Melanin-concentrating hormone receptor 1
Name:Melanin-concentrating hormone receptor 1
Type:G Protein-Coupled Receptor (GPCR)
Mol. Mass.:45976.27
Organism:Homo sapiens (Human)
Description:Membranes from CHO-K1 cells stably expressing human MCH1R were used in assays.
Residue:422
BDBM50214038
NameBDBM50214038
Synonyms:5-chloro-3-(((1S,3S)-3-(7-methoxy-4-methylquinolin-2-ylamino)cyclohexylamino)methyl)-N,N-dimethyl-1H-indole-1-carboxamide | CHEMBL249714
TypeSmall organic molecule
Emp. Form.C29H34ClN5O2
Mol. Mass.520.066
SMILESCOc1ccc2c(C)cc(N[C@H]3CCC[C@@H](C3)NCc3cn(C(=O)N(C)C)c4ccc(Cl)cc34)nc2c1