Reaction Details
TargetMelanin-concentrating hormone receptor 1
LigandBDBM50214045
Substrate/Competitorn/a
Meas. Tech.ChEMBL_456228 (CHEMBL888238)
IC50 35±n/a nM
Citation Giordanetto, FKarlsson, OLindberg, JLarsson, LOLinusson, AEvertsson, EMorgan, DGInghardt, T Discovery of cyclopentane- and cyclohexane-trans-1,3-diamines as potent melanin-concentrating hormone receptor 1 antagonists. Bioorg Med Chem Lett17:4232-41 (2007) 
 
Melanin-concentrating hormone receptor 1
Name:Melanin-concentrating hormone receptor 1
Type:G Protein-Coupled Receptor (GPCR)
Mol. Mass.:45976.27
Organism:Homo sapiens (Human)
Description:Membranes from CHO-K1 cells stably expressing human MCH1R were used in assays.
Residue:422
BDBM50214045
NameBDBM50214045
Synonyms:(1S,2S,4R,6S)-N2-(6-methoxy-4-methylquinolin-2-yl)-N6-(thiophen-3-ylmethyl)bicyclo[2.2.1]heptane-2,6-diamine | CHEMBL398864
TypeSmall organic molecule
Emp. Form.C23H27N3OS
Mol. Mass.393.545
SMILESCOc1ccc2nc(N[C@H]3C[C@H]4C[C@H](NCc5ccsc5)[C@@H]3C4)cc(C)c2c1