Reaction Details
TargetMelanin-concentrating hormone receptor 1
LigandBDBM50214050
Substrate/Competitorn/a
Meas. Tech.ChEMBL_456228 (CHEMBL888238)
IC50 10±n/a nM
Citation Giordanetto, FKarlsson, OLindberg, JLarsson, LOLinusson, AEvertsson, EMorgan, DGInghardt, T Discovery of cyclopentane- and cyclohexane-trans-1,3-diamines as potent melanin-concentrating hormone receptor 1 antagonists. Bioorg Med Chem Lett17:4232-41 (2007) 
 
Melanin-concentrating hormone receptor 1
Name:Melanin-concentrating hormone receptor 1
Type:G Protein-Coupled Receptor (GPCR)
Mol. Mass.:45976.27
Organism:Homo sapiens (Human)
Description:Membranes from CHO-K1 cells stably expressing human MCH1R were used in assays.
Residue:422
BDBM50214050
NameBDBM50214050
Synonyms:(1S,3S)-N1-(benzo[c][1,2,5]thiadiazol-4-ylmethyl)-N3-(7-methoxy-4-methylquinolin-2-yl)cyclohexane-1,3-diamine | CHEMBL250327
TypeSmall organic molecule
Emp. Form.C24H27N5OS
Mol. Mass.433.569
SMILESCOc1ccc2c(C)cc(N[C@H]3CCC[C@@H](C3)NCc3cccc4nsnc34)nc2c1