Reaction Details
TargetMelanin-concentrating hormone receptor 1
LigandBDBM50214047
Substrate/Competitorn/a
Meas. Tech.ChEMBL_456228 (CHEMBL888238)
IC50 20±n/a nM
Citation Giordanetto, FKarlsson, OLindberg, JLarsson, LOLinusson, AEvertsson, EMorgan, DGInghardt, T Discovery of cyclopentane- and cyclohexane-trans-1,3-diamines as potent melanin-concentrating hormone receptor 1 antagonists. Bioorg Med Chem Lett17:4232-41 (2007) 
 
Melanin-concentrating hormone receptor 1
Name:Melanin-concentrating hormone receptor 1
Type:G Protein-Coupled Receptor (GPCR)
Mol. Mass.:45976.27
Organism:Homo sapiens (Human)
Description:Membranes from CHO-K1 cells stably expressing human MCH1R were used in assays.
Residue:422
BDBM50214047
NameBDBM50214047
Synonyms:3-(((1S,3S)-3-(7-methoxy-4-methylquinolin-2-ylamino)cyclopentylamino)methyl)-1-methyl-1H-indole-7-carbonitrile | CHEMBL248863
TypeSmall organic molecule
Emp. Form.C27H29N5O
Mol. Mass.439.5521
SMILESCOc1ccc2c(C)cc(N[C@H]3CC[C@@H](C3)NCc3cn(C)c4c(cccc34)C#N)nc2c1