Reaction Details
TargetMelanin-concentrating hormone receptor 1
LigandBDBM50214066
Substrate/Competitorn/a
Meas. Tech.ChEMBL_456229 (CHEMBL888239)
IC50 83±n/a nM
Citation Giordanetto, FKarlsson, OLindberg, JLarsson, LOLinusson, AEvertsson, EMorgan, DGInghardt, T Discovery of cyclopentane- and cyclohexane-trans-1,3-diamines as potent melanin-concentrating hormone receptor 1 antagonists. Bioorg Med Chem Lett17:4232-41 (2007) 
 
Melanin-concentrating hormone receptor 1
Name:Melanin-concentrating hormone receptor 1
Type:G Protein-Coupled Receptor (GPCR)
Mol. Mass.:45976.27
Organism:Homo sapiens (Human)
Description:Membranes from CHO-K1 cells stably expressing human MCH1R were used in assays.
Residue:422
BDBM50214066
NameBDBM50214066
Synonyms:(1S,3S)-N1-(7-methoxy-4-methylquinolin-2-yl)-N3-((1-methyl-1H-pyrrolo[3,2-b]pyridin-3-yl)methyl)cyclopentane-1,3-diamine | CHEMBL251701
TypeSmall organic molecule
Emp. Form.C25H29N5O
Mol. Mass.415.5307
SMILESCOc1ccc2c(C)cc(N[C@H]3CC[C@@H](C3)NCc3cn(C)c4cccnc34)nc2c1