Reaction Details
TargetPeroxisome proliferator-activated receptor gamma
LigandBDBM50214197
Substrate/Competitorn/a
Meas. Tech.ChEMBL_437001 (CHEMBL886017)
EC50 3600±n/a nM
Citation Kasuga, JNakagome, IAoyama, ASako, KIshizawa, MOgura, MMakishima, MHirono, SHashimoto, YMiyachi, H Design, synthesis, and evaluation of potent, structurally novel peroxisome proliferator-activated receptor (PPAR) delta-selective agonists. Bioorg Med Chem15:5177-90 (2007) 
 
Peroxisome proliferator-activated receptor gamma
Name:Peroxisome proliferator-activated receptor gamma
Type:Nuclear Receptor
Mol. Mass.:57613.46
Organism:Homo sapiens (Human)
Description:P37231
Residue:505
BDBM50214197
NameBDBM50214197
Synonyms:2-{4-methoxy-3-[(4-trifluoromethylbenzoylamino)-methyl]phenylmethyl}pentanoic acid | CHEMBL229786
TypeSmall organic molecule
Emp. Form.C22H24F3NO4
Mol. Mass.423.4255
SMILESCCCC(Cc1ccc(OC)c(CNC(=O)c2ccc(cc2)C(F)(F)F)c1)C(O)=O