Reaction Details
TargetMotilin receptor
LigandBDBM50214253
Substrate/Competitorn/a
Meas. Tech.ChEMBL_447562 (CHEMBL896576)
Ki 20±n/a nM
Citation Marsault, EBenakli, KBeaubien, SSaint-Louis, CDéziel, RFraser, G Potent macrocyclic antagonists to the motilin receptor presenting novel unnatural amino acids. Bioorg Med Chem Lett17:4187-90 (2007) 
 
Motilin receptor
Name:Motilin receptor
Type:PROTEIN
Mol. Mass.:45365.95
Organism:Homo sapiens (Human)
Description:ChEMBL_122664
Residue:412
BDBM50214253
NameBDBM50214253
Synonyms:(5R,8R,11S)-8-(propan-2-yl)-11-[(pyrimidin-2-ylamino)methyl]-5-{[3-(trifluoromethyl)phenyl]methyl}-3,4,5,6,7,8,9,10,11,12,13,14,15,16-tetradecahydro-2H-1,4,7,10,13-benzoxatetrazacyclooctadecine-6,9,12-trione | CHEMBL231744
TypeSmall organic molecule
Emp. Form.C33H40F3N7O4
Mol. Mass.655.7104
SMILESCC(C)[C@H]1NC(=O)[C@@H](Cc2cccc(c2)C(F)(F)F)NCCOc2ccccc2CCCNC(=O)[C@H](CNc2ncccn2)NC1=O