Reaction Details
TargetMotilin receptor
LigandBDBM50214269
Substrate/Competitorn/a
Meas. Tech.ChEMBL_447562 (CHEMBL896576)
Ki 57±n/a nM
Citation Marsault, EBenakli, KBeaubien, SSaint-Louis, CDéziel, RFraser, G Potent macrocyclic antagonists to the motilin receptor presenting novel unnatural amino acids. Bioorg Med Chem Lett17:4187-90 (2007) 
 
Motilin receptor
Name:Motilin receptor
Type:PROTEIN
Mol. Mass.:45365.95
Organism:Homo sapiens (Human)
Description:ChEMBL_122664
Residue:412
BDBM50214269
NameBDBM50214269
Synonyms:1-{[(5R,8R,11S)-5-[(3-chlorophenyl)methyl]-6,9,12-trioxo-8-(propan-2-yl)-3,4,5,6,7,8,9,10,11,12,13,14,15,16-tetradecahydro-2H-1,4,7,10,13-benzoxatetrazacyclooctadecin-11-yl]methyl}guanidine | CHEMBL392553
TypeSmall organic molecule
Emp. Form.C29H40ClN7O4
Mol. Mass.586.125
SMILES[#6]-[#6](-[#6])-[#6@H]-1-[#7]-[#6](=O)-[#6@@H](-[#6]-c2cccc(Cl)c2)-[#7]-[#6]-[#6]-[#8]-c2ccccc2-[#6]-[#6]-[#6]-[#7]-[#6](=O)-[#6@H](-[#6]\[#7]=[#6](\[#7])-[#7])-[#7]-[#6]-1=O