Reaction Details
TargetMotilin receptor
LigandBDBM50214272
Substrate/Competitorn/a
Meas. Tech.ChEMBL_447562 (CHEMBL896576)
Ki 15±n/a nM
Citation Marsault, EBenakli, KBeaubien, SSaint-Louis, CDéziel, RFraser, G Potent macrocyclic antagonists to the motilin receptor presenting novel unnatural amino acids. Bioorg Med Chem Lett17:4187-90 (2007) 
 
Motilin receptor
Name:Motilin receptor
Type:PROTEIN
Mol. Mass.:45365.95
Organism:Homo sapiens (Human)
Description:ChEMBL_122664
Residue:412
BDBM50214272
NameBDBM50214272
Synonyms:(5R,8R,11S)-11-(aminomethyl)-8-(propan-2-yl)-5-{[3-(trifluoromethyl)phenyl]methyl}-3,4,5,6,7,8,9,10,11,12,13,14,15,16-tetradecahydro-2H-1,4,7,10,13-benzoxatetrazacyclooctadecine-6,9,12-trione | CHEMBL274876
TypeSmall organic molecule
Emp. Form.C29H38F3N5O4
Mol. Mass.577.6383
SMILESCC(C)[C@H]1NC(=O)[C@@H](Cc2cccc(c2)C(F)(F)F)NCCOc2ccccc2CCCNC(=O)[C@H](CN)NC1=O